{"text_format":"1","workbook":"xlsx","n_sheets":10,"sheets":["Тариф.Кальк","Ожидания","MORT","lx","lx2","Резервы","риск","Лист1","Базис","Лист2"],"not_rendered":{"charts":0,"images":4,"macros":1,"external_links":1,"defined_names":36,"comments":1,"pivot_tables":0},"unopened":[],"bounds":{"document_bytes":16777216,"sheet_cells":100000,"rows_first":2000,"rows_last":500,"rows_between":2000,"halvings":0,"cell_chars":16384,"cell_head_chars":4096},"cells_cut":0,"cells_raw":0,"read":"whole","date_system":"1900"}

{"sheet":"Тариф.Кальк","index":0,"n_rows":74,"n_cols":12,"rows_kept":74,"cut":false,"hidden":false,"merged":[[65,2,65,3],[61,2,61,3],[62,2,62,3],[63,2,63,3],[48,2,48,3],[46,2,46,3],[1,2,1,7],[2,2,2,7],[43,4,43,6],[4,4,4,7],[42,2,42,3],[44,2,44,3],[18,2,18,3]]}
[]
[]
[null,null,"МЕДАЛИСТ"]
[null,null,null,null,null,null,null,null,null,null,{"$f":"DATE(YEAR(E14)+E16,MONTH(E14),DAY(E14)-1)","v":{"$error":"#N/A"}}]
[null,null,"Тарифный калькулятор.",null,"версия 1.3 от 02.2024 г.",null,null,null,null,null,{"$f":"(DATE(YEAR(E14)+E16,MONTH(E14)-1,DAY(E14)))","v":{"$error":"#N/A"}}]
[]
[]
[null,null,"ПРЕДПОЛАГАЕМЫЕ ДАТЫ ОПЛАТЫ ВЗНОСА И ВСТУПЛЕНИЯ ДОГОВОРА В СИЛУ",null,null,null,null,null,null,{"$f":"IF(MONTH(E14)>=7,DATE(IF(AND(MONTH(K8)>=1,MONTH(K8)<=6),YEAR(K8)-1,YEAR(K8)),7,DAY(K8)),DATE(IF(AND(MONTH(K8)>=1,MONTH(K8)>=6),YEAR(K8)-1,YEAR(K8)+1),7,DAY(K8)-31))","v":{"$error":"#N/A"}},{"$f":"IF(MONTH(E14>=7),(DATE(YEAR(E14)+E16,MONTH(E14),DAY(E14)-1)),EOMONTH(DATE(YEAR(E14)+E16,MONTH(E14)-1,DAY(E14)),0))","v":{"$error":"#N/A"}},{"$f":"K8","v":{"$error":"#N/A"}}]
[null,null,null,null,null,null,null,null,null,null,{"$f":"DATE(IF(MONTH(K8)>=6,YEAR(K8),YEAR(K8)-1),7,DAY(K8))","v":{"$error":"#N/A"}}]
[null,null,"Класс, в котором обучается Застрахованное лицо",null,null,null,null,null,null,null,{"$f":"IF(MONTH(E14)>=7,K9-DAY(K9)+1,DATE(YEAR(K9),MONTH(K9),DAY(K9)))","v":{"$error":"#N/A"}}]
{"$rows_left_out":65}
{"sheet":"Ожидания","index":1,"n_rows":27,"n_cols":7,"rows_kept":27,"cut":false,"hidden":true,"merged":[[0,1,0,5]]}
[null,"РАСЧЕТ ОЖИДАНИЙ"]
[]
[null,"Год действия договора страхования","Размер годового взноса","Ожидаемый размер дополнительного инвестиционного дохода по результатам инвестиционной деятельности","Ожидаемый размер страховой суммы с учетом допинвестдохода","Расчетная сумма налогового вычета"]
[null,{"$f":"IF(AND(Резервы!C6<=Тариф.Кальк!$E$16,Резервы!C6<>\"\"),Резервы!C6,\"\")","v":{"$error":"#N/A"}},{"$f":"IF(B4<>\"\",IF(Тариф.Кальк!$L$49=0,IF(B4=1,Тариф.Кальк!$G$69,0),Тариф.Кальк!$G$69*B4*Тариф.Кальк!$L$49),\"\")","v":{"$error":"#N/A"}},{"$f":"IF(B4<>\"\",Резервы!H6,\"\")","v":{"$error":"#N/A"}},{"$f":"IF(B4<>\"\",Тариф.Кальк!$G$62+D4,\"\")","v":{"$error":"#N/A"}},{"$f":"IF(B4<>\"\",IF(Тариф.Кальк!$L$49=0,MIN(19500,0.13*C4),MIN(19500,0.13*$C$4)),\"\")","v":{"$error":"#N/A"}},{"$f":"IF(K41=\"раз в полгода\",F5,F5)","v":{"$error":"#N/A"}}]
[null,{"$f":"IF(AND(Резервы!C7<=Тариф.Кальк!$E$16,Резервы!C7<>\"\"),Резервы!C7,\"\")","v":{"$error":"#N/A"}},{"$f":"IF(B5<>\"\",IF(Тариф.Кальк!$L$49=0,IF(B5=1,Тариф.Кальк!$G$69,0),Тариф.Кальк!$G$69*B5*Тариф.Кальк!$L$49),\"\")","v":{"$error":"#N/A"}},{"$f":"IF(B5<>\"\",Резервы!H7,\"\")","v":{"$error":"#N/A"}},{"$f":"IF(B5<>\"\",Тариф.Кальк!$G$62+D5,\"\")","v":{"$error":"#N/A"}},{"$f":"IF(B5<>\"\",IF(Тариф.Кальк!$L$49=0,MIN(19500,0.13*C5),MIN(19500,0.13*$C$4)),\"\")","v":{"$error":"#N/A"}}]
[null,{"$f":"IF(AND(Резервы!C8<=Тариф.Кальк!$E$16,Резервы!C8<>\"\"),Резервы!C8,\"\")","v":{"$error":"#N/A"}},{"$f":"IF(B6<>\"\",IF(Тариф.Кальк!$L$49=0,IF(B6=1,Тариф.Кальк!$G$69,0),Тариф.Кальк!$G$69*B6*Тариф.Кальк!$L$49),\"\")","v":{"$error":"#N/A"}},{"$f":"IF(B6<>\"\",Резервы!H8,\"\")","v":{"$error":"#N/A"}},{"$f":"IF(B6<>\"\",Тариф.Кальк!$G$62+D6,\"\")","v":{"$error":"#N/A"}},{"$f":"IF(B6<>\"\",IF(Тариф.Кальк!$L$49=0,MIN(19500,0.13*C6),MIN(19500,0.13*$C$4)),\"\")","v":{"$error":"#N/A"}}]
[null,{"$f":"IF(AND(Резервы!C9<=Тариф.Кальк!$E$16,Резервы!C9<>\"\"),Резервы!C9,\"\")","v":{"$error":"#N/A"}},{"$f":"IF(B7<>\"\",IF(Тариф.Кальк!$L$49=0,IF(B7=1,Тариф.Кальк!$G$69,0),Тариф.Кальк!$G$69*B7*Тариф.Кальк!$L$49),\"\")","v":{"$error":"#N/A"}},{"$f":"IF(B7<>\"\",Резервы!H9,\"\")","v":{"$error":"#N/A"}},{"$f":"IF(B7<>\"\",Тариф.Кальк!$G$62+D7,\"\")","v":{"$error":"#N/A"}},{"$f":"IF(B7<>\"\",IF(Тариф.Кальк!$L$49=0,MIN(19500,0.13*C7),MIN(19500,0.13*$C$4)),\"\")","v":{"$error":"#N/A"}}]
[null,{"$f":"IF(AND(Резервы!C10<=Тариф.Кальк!$E$16,Резервы!C10<>\"\"),Резервы!C10,\"\")","v":{"$error":"#N/A"}},{"$f":"IF(B8<>\"\",IF(Тариф.Кальк!$L$49=0,IF(B8=1,Тариф.Кальк!$G$69,0),Тариф.Кальк!$G$69*B8*Тариф.Кальк!$L$49),\"\")","v":{"$error":"#N/A"}},{"$f":"IF(B8<>\"\",Резервы!H10,\"\")","v":{"$error":"#N/A"}},{"$f":"IF(B8<>\"\",Тариф.Кальк!$G$62+D8,\"\")","v":{"$error":"#N/A"}},{"$f":"IF(B8<>\"\",IF(Тариф.Кальк!$L$49=0,MIN(19500,0.13*C8),MIN(19500,0.13*$C$4)),\"\")","v":{"$error":"#N/A"}}]
[null,{"$f":"IF(AND(Резервы!C11<=Тариф.Кальк!$E$16,Резервы!C11<>\"\"),Резервы!C11,\"\")","v":{"$error":"#N/A"}},{"$f":"IF(B9<>\"\",IF(Тариф.Кальк!$L$49=0,IF(B9=1,Тариф.Кальк!$G$69,0),Тариф.Кальк!$G$69*B9*Тариф.Кальк!$L$49),\"\")","v":{"$error":"#N/A"}},{"$f":"IF(B9<>\"\",Резервы!H11,\"\")","v":{"$error":"#N/A"}},{"$f":"IF(B9<>\"\",Тариф.Кальк!$G$62+D9,\"\")","v":{"$error":"#N/A"}},{"$f":"IF(B9<>\"\",IF(Тариф.Кальк!$L$49=0,MIN(19500,0.13*C9),MIN(19500,0.13*$C$4)),\"\")","v":{"$error":"#N/A"}}]
[null,{"$f":"IF(AND(Резервы!C12<=Тариф.Кальк!$E$16,Резервы!C12<>\"\"),Резервы!C12,\"\")","v":{"$error":"#N/A"}},{"$f":"IF(B10<>\"\",IF(Тариф.Кальк!$L$49=0,IF(B10=1,Тариф.Кальк!$G$69,0),Тариф.Кальк!$G$69*B10*Тариф.Кальк!$L$49),\"\")","v":{"$error":"#N/A"}},{"$f":"IF(B10<>\"\",Резервы!H12,\"\")","v":{"$error":"#N/A"}},{"$f":"IF(B10<>\"\",Тариф.Кальк!$G$62+D10,\"\")","v":{"$error":"#N/A"}},{"$f":"IF(B10<>\"\",IF(Тариф.Кальк!$L$49=0,MIN(19500,0.13*C10),MIN(19500,0.13*$C$4)),\"\")","v":{"$error":"#N/A"}}]
{"$rows_left_out":18}
{"sheet":"MORT","index":2,"n_rows":106,"n_cols":25,"rows_kept":106,"cut":false,"hidden":true,"merged":[[0,0,0,22],[1,0,1,10],[1,12,1,22],[2,0,2,10],[2,12,2,22]]}
["Tаблица смертности и коммутационных чисел",null,null,null,null,null,null,null,null,null,null,null,null,null,null,null,null,null,null,null,null,null,null,"i =",0.1]
["Для мужчин",null,null,null,null,null,null,null,null,null,null,null,"Для женщин",null,null,null,null,null,null,null,null,null,null,"v =",{"$f":"1/(1+Y1)","v":0.90909090909090906}]
["Норма доходности 5,5 %",null,null,null,null,null,null,null,null,null,null,null,"Норма доходности 5,5 %"]
["x","lx","dx","qx","px","Dx","Nx","Sx","Cx","Mx","Rx",null,"x","lx","dx","qx","px","Dx","Nx","Sx","Cx","Mx","Rx"]
[0,100000,{"$f":"B5-B6","v":661},null,null,{"$f":"$Y$2^A5*B5","v":100000},{"$f":"SUM(F5:F$106)","v":1083497.6299721862},{"$f":"SUM($G5:G$106)","v":11615094.268398993},{"$f":"$Y$2^(A5+1)*C5","v":600.90909090909088},{"$f":"SUM($I5:I$106)","v":1500.2154570738853},{"$f":"SUM($J5:J$106)","v":27579.969208641291},null,0,100000,{"$f":"N5-N6","v":539},null,null,{"$f":"$Y$2^M5*N5","v":100000},{"$f":"SUM(R5:R$106)","v":1089756.0249368032},{"$f":"SUM($S5:S$106)","v":11844695.036932692},{"$f":"$Y$2^(M5+1)*O5","v":490},{"$f":"SUM($U5:U$106)","v":931.27046029047392},{"$f":"SUM($V5:V$106)","v":12965.567033833058}]
[1,99339,{"$f":"B6-B7","v":61},null,null,{"$f":"$Y$2^A6*B6","v":90308.181818181809},{"$f":"SUM(F6:F$106)","v":983497.62997218699},{"$f":"SUM($G6:G$106)","v":10531596.638426809},{"$f":"$Y$2^(A6+1)*C6","v":50.413223140495859},{"$f":"SUM($I6:I$106)","v":899.30636616479467},{"$f":"SUM($J6:J$106)","v":26079.753751567408},null,1,99461,{"$f":"N6-N7","v":51},null,null,{"$f":"$Y$2^M6*N6","v":90419.090909090912},{"$f":"SUM(R6:R$106)","v":989756.02493680478},{"$f":"SUM($S6:S$106)","v":10754939.011995887},{"$f":"$Y$2^(M6+1)*O6","v":42.148760330578511},{"$f":"SUM($U6:U$106)","v":441.27046029047392},{"$f":"SUM($V6:V$106)","v":12034.296573542588}]
[2,99278,39,null,null,82047.933884297512,{"$f":"SUM(F7:F$106)","v":893189.44815400534},{"$f":"SUM($G7:G$106)","v":9548099.0084546208},29.301277235161528,{"$f":"SUM($I7:I$106)","v":848.89314302429875},{"$f":"SUM($J7:J$106)","v":25180.447385402611},null,2,99410,28,null,null,82157.024793388424,{"$f":"SUM(R7:R$106)","v":899336.93402771384},{"$f":"SUM($S7:S$106)","v":9765182.987059081},21.036814425244174,{"$f":"SUM($U7:U$106)","v":399.12169995989541},{"$f":"SUM($V7:V$106)","v":11593.02611325211}]
[3,99239,33,null,null,74559.729526671668,{"$f":"SUM(F8:F$106)","v":811141.51426970784},{"$f":"SUM($G8:G$106)","v":8654909.5603006165},22.539444027047328,{"$f":"SUM($I8:I$106)","v":819.59186578913727},{"$f":"SUM($J8:J$106)","v":24331.554242378315},null,3,99382,24,null,null,74667.167543200587,{"$f":"SUM(R8:R$106)","v":817179.9092343254},{"$f":"SUM($S8:S$106)","v":8865846.0530313645},16.392322928761693,{"$f":"SUM($U8:U$106)","v":378.08488553465133},{"$f":"SUM($V8:V$106)","v":11193.904413292212}]
[4,99206,26,null,null,67759.032852947188,{"$f":"SUM(F9:F$106)","v":736581.78474303603},{"$f":"SUM($G9:G$106)","v":7843768.0460309107},16.143954399538032,{"$f":"SUM($I9:I$106)","v":797.05242176209003},{"$f":"SUM($J9:J$106)","v":23511.962376589181},null,4,99358,22,null,null,67862.85089816268,{"$f":"SUM(R9:R$106)","v":742512.74169112474},{"$f":"SUM($S9:S$106)","v":8048666.1437970316},13.66026910730141,{"$f":"SUM($U9:U$106)","v":361.69256260588958},{"$f":"SUM($V9:V$106)","v":10815.819527757561}]
[5,99180,26,null,null,61582.976821006996,{"$f":"SUM(F10:F$106)","v":668822.7518900889},{"$f":"SUM($G10:G$106)","v":7107186.2612878755},14.676322181398207,{"$f":"SUM($I10:I$106)","v":780.90846736255207},{"$f":"SUM($J10:J$106)","v":22714.90995482709},null,5,99336,19,null,null,61679.840547404223,{"$f":"SUM(R10:R$106)","v":674649.89079296216},{"$f":"SUM($S10:S$106)","v":7306153.402105906},10.725004671021766,{"$f":"SUM($U10:U$106)","v":348.03229349858805},{"$f":"SUM($V10:V$106)","v":10454.126965151674}]
{"$rows_left_out":97}
{"sheet":"lx","index":3,"n_rows":102,"n_cols":5,"rows_kept":102,"cut":false,"hidden":true,"merged":[]}
["Возраст","m","f"]
[0,100000,100000,{"$f":"IF((B2-B3)/B2<0,1,(B2-B3)/B2)","v":6.6100000000000004E-3},{"$f":"IF((C2-C3)/C2<0,1,(C2-C3)/C2)","v":5.3899999999999998E-3}]
[1,99339,99461,{"$f":"IF((B3-B4)/B3<0,1,(B3-B4)/B3)","v":6.140589295241547E-4},5.1276379686510294E-4]
[2,99278,99410,3.9283627792663025E-4,2.8166180464741977E-4]
[3,99239,99382,3.3253055754290148E-4,2.4149242317522289E-4]
[4,99206,99358,2.620809225248473E-4,2.2142152619819241E-4]
[5,99180,99336,2.6214962694091551E-4,1.9127003301924779E-4]
[6,99154,99317,2.2187708009762592E-4,1.6110031515249152E-4]
[7,99132,99301,2.3201388048258887E-4,1.8126705672651835E-4]
[8,99109,99283,2.320677234156333E-4,1.8129992042947938E-4]
{"$rows_left_out":93}
{"sheet":"lx2","index":4,"n_rows":1202,"n_cols":10,"rows_kept":1202,"cut":false,"hidden":true,"merged":[]}
[null,"m","f"]
[0,100000,100000,0,0,null,null,null,100000,100000]
[1,99944.916666666672,99955.083333333328,0,1,null,null,null,99944.916666666672,99955.083333333328]
[2,99889.833333333328,99910.166666666672,0,2,null,null,null,99889.833333333328,99910.166666666672]
[3,99834.75,99865.25,0,3,null,null,null,99834.75,99865.25]
[4,99779.666666666672,99820.333333333328,0,4,null,null,null,99779.666666666672,99820.333333333328]
[5,99724.583333333328,99775.416666666672,0,5,null,null,null,99724.583333333328,99775.416666666672]
[6,99669.5,99730.5,0,6,null,null,null,99669.5,99730.5]
[7,99614.416666666672,99685.583333333328,0,7,null,null,null,99614.416666666672,99685.583333333328]
[8,99559.333333333328,99640.666666666672,0,8,null,null,null,99559.333333333328,99640.666666666672]
{"$rows_left_out":1193}
{"sheet":"Резервы","index":5,"n_rows":95,"n_cols":22,"rows_kept":95,"cut":false,"hidden":true,"merged":[]}
[null,"euro",0.02]
[null,"USD",0.04]
[null,"руб",{"$f":"IF(Тариф.Кальк!$E$40<=8,0.08,IF(Тариф.Кальк!$E$40<=14,0.07,0.065))","v":0.08}]
[]
[null,null,"ГД","Годовщина","Гарант дох-ть","Мат.резерв на начало года","Взнос","ДИД"]
[null,null,1,0,0.1,0,50000,{"$f":"IF($C6<>\"\",IF($C6=1,IF(Тариф.Кальк!L51>=1,0,0.5)*$F6*(VLOOKUP(Тариф.Кальк!$G$40,Резервы!$B$1:$C$3,2,FALSE)-E6),$F6*(VLOOKUP(Тариф.Кальк!$G$40,Резервы!$B$1:$C$3,2,FALSE)-E6)+$H5*(1+VLOOKUP(Тариф.Кальк!$G$40,Резервы!$B$1:$C$3,2,FALSE))),0)","v":0},null,null,null,null,null,null,6,null,11,1,0.1,1647377,0,0.15]
[null,null,2,1,0.1,88676.772065423895,50000,{"$f":"IF($C7<>\"\",IF($C7=1,IF(Тариф.Кальк!L52>=1,0,0.5)*$F7*(VLOOKUP(Тариф.Кальк!$G$40,Резервы!$B$1:$C$3,2,FALSE)-E7),$F7*(VLOOKUP(Тариф.Кальк!$G$40,Резервы!$B$1:$C$3,2,FALSE)-E7)+$H6*(1+VLOOKUP(Тариф.Кальк!$G$40,Резервы!$B$1:$C$3,2,FALSE))),0)","v":-1773.5354413084783},null,null,null,null,null,null,6,null,11,1,0.1,1647377,0,0.15]
[null,null,3,2,0.1,186244.75736300735,50000,{"$f":"IF($C8<>\"\",IF($C8=1,IF(Тариф.Кальк!L53>=1,0,0.5)*$F8*(VLOOKUP(Тариф.Кальк!$G$40,Резервы!$B$1:$C$3,2,FALSE)-E8),$F8*(VLOOKUP(Тариф.Кальк!$G$40,Резервы!$B$1:$C$3,2,FALSE)-E8)+$H7*(1+VLOOKUP(Тариф.Кальк!$G$40,Резервы!$B$1:$C$3,2,FALSE))),0)","v":-5640.3134238733037},null,null,null,null,null,null,6,null,11,1,0.1,1647377,0,0.15]
[null,null,4,3,0.1,293594.46362025366,50000,{"$f":"IF($C9<>\"\",IF($C9=1,IF(Тариф.Кальк!L54>=1,0,0.5)*$F9*(VLOOKUP(Тариф.Кальк!$G$40,Резервы!$B$1:$C$3,2,FALSE)-E9),$F9*(VLOOKUP(Тариф.Кальк!$G$40,Резервы!$B$1:$C$3,2,FALSE)-E9)+$H8*(1+VLOOKUP(Тариф.Кальк!$G$40,Резервы!$B$1:$C$3,2,FALSE))),0)","v":-11963.427770188242},null,null,null,null,null,null,6,null,11,1,0.1,1647377,0,0.15]
[null,null,5,4,0.1,411706.57268926437,50000,{"$f":"IF($C10<>\"\",IF($C10=1,IF(Тариф.Кальк!L55>=1,0,0.5)*$F10*(VLOOKUP(Тариф.Кальк!$G$40,Резервы!$B$1:$C$3,2,FALSE)-E10),$F10*(VLOOKUP(Тариф.Кальк!$G$40,Резервы!$B$1:$C$3,2,FALSE)-E10)+$H9*(1+VLOOKUP(Тариф.Кальк!$G$40,Резервы!$B$1:$C$3,2,FALSE))),0)","v":-21154.633445588592},null,null,null,null,null,null,6,null,11,1,0.1,1647377,0,0.15]
{"$rows_left_out":86}
{"sheet":"риск","index":6,"n_rows":28,"n_cols":19,"rows_kept":28,"cut":false,"hidden":true,"merged":[[23,4,24,4]]}
[]
[]
[null,null,null,"Смерть Застрахованного лица в результате несчастного случая",1000,1,3.21E-4,3.2099999999999997E-2,6.8000000000000005E-2,0.10009999999999999,2.13]
[null,null,null,"Инвалидность Застрахованного лица в результате несчастного случая",1000,1,5.8399999999999999E-4,5.8400000000000001E-2,9.1700000000000004E-2,0.15010000000000001,0.23]
[]
[null,null,null,"Госпитализация Застрахованного в результате несчастного случая",1000,0.05,2.7519999999999999E-2,0.1376,3.1E-2,0.1686,0.26]
[null,null,null,"Госпитализация Страхователя в результате несчастного случая",1000,4.4999999999999998E-2,2.3769999999999999E-2,0.107,2.5999999999999999E-2,0.13300000000000001,0.2]
[null,null,null,"Смерть Страхователя в результате несчастного случая",1000,1,7.6499999999999995E-4,7.6499999999999999E-2,0.10489999999999999,0.18140000000000001,0.28000000000000003]
[null,null,null,null,null,null,null,null,null,null,null,"свежее"]
[null,null,null,"Смерть в результате НС или болезни",5000,8.6999999999999993,1.438E-3,1.2511000000000001,0.5595,1.8106,2.13,"Риск","n","μ/S","q","tо","tp","t","оув"]
{"$rows_left_out":19}
{"sheet":"Лист1","index":7,"n_rows":36,"n_cols":13,"rows_kept":36,"cut":false,"hidden":true,"merged":[[1,0,2,0],[1,1,2,1],[1,2,1,11],[17,0,17,1]]}
[]
["Календарный месяц","Дата начала","Срок действия договора"]
[null,null,1,2,3,4,5,6,7,8,9,10,11]
[1,"2024-01-02",{"$f":"B4+365","v":"2025-01-01"},{"$f":"C4+365","v":"2026-01-01"},{"$f":"D4+365","v":"2027-01-01"},{"$f":"E4+365","v":"2028-01-01"},{"$f":"F4+366","v":"2029-01-01"},{"$f":"G4+365","v":"2030-01-01"},"2031-01-01","2032-01-01",{"$f":"J4+366","v":"2033-01-01"},{"$f":"K4+365","v":"2034-01-01"},"2035-01-01"]
[2,"2024-02-02",{"$f":"B5+365","v":"2025-02-01"},"2026-02-01","2027-02-01","2028-02-01",{"$f":"F5+366","v":"2029-02-01"},"2030-02-01","2031-02-01","2032-02-01",{"$f":"J5+366","v":"2033-02-01"},"2034-02-01","2035-02-01"]
[3,"2024-03-02",{"$f":"B6+364","v":"2025-03-01"},"2026-03-01","2027-03-01","2028-02-29",{"$f":"F6+366","v":"2029-03-01"},"2030-03-01","2031-03-01","2032-02-29",{"$f":"J6+366","v":"2033-03-01"},"2034-03-01","2035-03-01"]
[4,"2024-04-02","2025-04-01","2026-04-01","2027-04-01",{"$f":"E7+366","v":"2028-04-01"},{"$f":"F7+365","v":"2029-04-01"},{"$f":"G7+365","v":"2030-04-01"},{"$f":"H7+365","v":"2031-04-01"},{"$f":"I7+366","v":"2032-04-01"},{"$f":"J7+365","v":"2033-04-01"},"2034-04-01","2035-04-01"]
[5,"2024-05-02","2025-05-01","2026-05-01","2027-05-01",{"$f":"E8+366","v":"2028-05-01"},{"$f":"F8+365","v":"2029-05-01"},"2030-05-01","2031-05-01",{"$f":"I8+366","v":"2032-05-01"},{"$f":"J8+365","v":"2033-05-01"},"2034-05-01","2035-05-01"]
[6,"2024-06-02","2025-06-01","2026-06-01","2027-06-01","2028-06-01","2029-06-01","2030-06-01","2031-06-01","2032-06-01","2033-06-01","2034-06-01","2035-06-01"]
[7,"2024-07-02","2025-07-01","2026-07-01","2027-07-01","2028-07-01","2029-07-01","2030-07-01","2031-07-01","2032-07-01","2033-07-01","2034-07-01","2035-07-01"]
{"$rows_left_out":27}
{"sheet":"Базис","index":8,"n_rows":90,"n_cols":44,"rows_kept":90,"cut":false,"hidden":true,"merged":[[71,10,72,10],[71,11,71,29],[47,10,47,23],[69,10,69,23],[27,10,28,10],[27,11,27,29],[25,10,25,23],[49,10,50,10],[49,11,49,29],[0,4,0,5],[0,7,0,8],[5,11,5,29],[5,10,6,10],[3,10,3,23],[0,10,0,29]]}
["ПОЛ",null,"Срок страхования",null,"Периодичность",null,null,"Возраст Страхователя на дату окончания периода оплаты взносов",null,null,"Риски «Дожитие Застрахованного лица» и «Смерть Застрахованного лица»"]
["муж",null,5,null,"Единовременно (0)",1,null,"от 18 до 44 лет ",0.7,null,null,null,null,null,null,null,null,null,null,null,null,null,null,null,null,null,null,null,null,null,null,"руб",null,"единовременно",0,1,null,"подготовительный",0,12,"29/11/2023 отменили",null,"мать","конец января, отменили родство"]
["жен",null,6,null,"Ежегодно (1)",1,null,"45 – 54",1,null,null,null,null,null,null,null,null,null,null,null,null,null,null,null,null,null,null,null,null,null,null,"USD",null,"ежегодно",1,1,null,1,1,11,null,null,"отец"]
[null,null,7,null,"Раз в полгода (2)",0.51,null,"от 55 до 74 лет",1.6,null,"ЕДИНОВРЕМЕННЫЙ ВЗНОС. Таблица тарифов для лиц МУЖСКОГО пола. ",null,null,null,null,null,null,null,null,null,null,null,null,null,null,null,null,null,null,null,null,"euro",null,"раз в полгода",2,0.51,null,2,2,10,null,null,"усыновитель "]
[null,null,8,null,"Ежеквартально (4)",0.27,null,null,null,null,null,null,null,null,null,null,null,null,null,null,null,null,null,null,null,null,null,null,null,null,null,null,null,"ежеквартально",4,null,null,3,3,9,null,null,"дедушка "]
[null,null,9,null,null,null,null,null,null,null,"Возраст на начало страхования","Срок страхования (лет)",null,null,null,null,null,null,null,null,null,null,null,null,null,null,null,null,null,null,null,null,null,"ежемесячно",12,null,null,4,4,8,null,null,"бабушка "]
[null,null,10,null,null,null,null,null,null,null,null,5,6,7,8,9,10,11,12,13,14,15,16,17,18,19,20,21,22,23,null,null,null,null,null,null,null,5,5,7,null,null,"брат"]
[null,null,11,null,null,null,null,null,null,null,1,0.95686300000000002,0.92448900000000001,0.893204,0.86297199999999996,0.85212699999999997,0.82526500000000003,0.79924700000000004,0.77403599999999995,0.74960199999999999,0.72592199999999996,0.72904599999999997,0.707677,0.68688800000000005,0.66662900000000003,0.64693100000000003,0.62775199999999998,0.60906800000000005,0.59091899999999997,0.57326600000000005,null,null,null,null,null,null,null,6,6,6,null,null,"сестра"]
[null,null,12,null,null,null,null,null,null,null,2,0.956839,0.92446499999999998,0.893181,0.86294899999999997,0.85209900000000005,0.82523899999999994,0.79921399999999998,0.77399200000000001,0.74954900000000002,0.72584599999999999,0.72895600000000005,0.70755199999999996,0.68669899999999995,0.66642500000000005,0.64668499999999995,0.62745700000000004,0.60877800000000004,0.59060900000000005,null,null,null,null,null,null,null,null,7,7,5]
[null,null,13,null,null,null,null,null,null,null,3,0.95682800000000001,0.92445500000000003,0.89317199999999997,0.86293699999999995,0.85208499999999998,0.82522099999999998,0.79918500000000003,0.77395499999999995,0.74948899999999996,0.72576799999999997,0.72884800000000005,0.70738400000000001,0.68651700000000004,0.66620100000000004,0.64641300000000002,0.62719000000000003,0.608491,null,null,null,null,null,null,null,null,null,"18/01/2024 отмена 7 класса"]
{"$rows_left_out":81}
{"sheet":"Лист2","index":9,"n_rows":23,"n_cols":11,"rows_kept":23,"cut":false,"hidden":true,"merged":[]}
[null,null,null,null,"тариф",null,"премия"]
[null,null,null,null,"нетто","брутто","нетто","брутто"]
[null,null,null,"Дожитие",4.8924660631120991E-2,5.7558424271907049E-2,80597.360656514211,94820.42430178143]
[null,null,null,"Медаль 1 ",1.552240150112606E-3,1.8261648824854189E-3,2557.1247217720547,3008.3820256141821]
[null,null,null,"Медаль 2",0,0,0,0]
[null,null,null,"Смерть",1.0855672389246738E-4,1.2771379281466752E-4,178.83385013580124,210.39276486564853]
[null,null,null,null,null,null,{"$f":"SUM(G3:G6)","v":83333.319228422071},933761,null,50000]
[]
[]
[]
{"$rows_left_out":13}